{{ message }}
Repository navigation
fix(deps): sync katex 0.19.0 in package-lock.json for npm ci #941
ci.yml
on: push
Matrix: test
Modelica OMC Testsuite (WASM vs JS)
18m 5s
publish_reports
1m 50s
Oh hello! Nice to see you.
Made with ❤️ by humans.txt
Annotations
14 errors, 9 warnings, and 8 notices
|
lint
The job has exceeded the maximum execution time of 10m0s
|
|
lint
The operation was canceled.
|
|
Modelica OMC Testsuite (WASM vs JS)
Process completed with exit code 1.
|
|
test (4)
Process completed with exit code 1.
|
|
Failed Test: ConnectArrayCond2.mo:
languages/modelica/testsuite/OpenModelica/flattening/modelica/connectors/ConnectArrayCond2.mo#L0
ConnectArrayCond2.mo: Output mismatch:
+ 1 class ConnectArrayCond2
- 7 equation
2 parameter Boolean foo[1].enabled = true;
3 Real foo[1].x;
···
6 Real src1.x = time;
7 equation
- 10 end ConnectArrayCond2;
9 foo[2].x = src1.x;
10 end ConnectArrayCond2;
(expected 10 lines, got 9 lines)
--- Expected ---
class ConnectArrayCond2
parameter Boolean foo[1].enabled = true;
Real foo[1].x;
parameter Boolean foo[2].enabled = false;
Real src.x = time;
Real src1.x = time;
equation
foo[1].x = src.x;
foo[2].x = src1.x;
end ConnectArrayCond2;
--- Actual ---
class ConnectArrayCond2
parameter Boolean foo[1].enabled = true;
Real foo[1].x;
parameter Boolean foo[2].enabled = false;
Real src.x = time;
Real src1.x = time;
equation
src.x = foo[1].x;
end ConnectArrayCond2; - No trace available
|
|
Failed Test: ConnectArrayCond.mo:
languages/modelica/testsuite/OpenModelica/flattening/modelica/connectors/ConnectArrayCond.mo#L0
ConnectArrayCond.mo: Flattening returned null (expected a result)
Diagnostics:
[21:17-21:18] Error: Variable c1[1].c not found in scope ConnectArrayCond.
[21:26-21:27] Error: Variable c1[2].c not found in scope ConnectArrayCond. - No trace available
|
|
Failed Test: Connect12.mo:
languages/modelica/testsuite/OpenModelica/flattening/modelica/connectors/Connect12.mo#L0
Connect12.mo: Flattening returned null (expected a result)
Diagnostics:
[24:3-24:24] Error: [M4092] Type mismatch in binding 'v = {1.,2.4}', expected array dimensions [], got [2]. - No trace available
|
|
Failed Test: Bug3649.mo:
languages/modelica/testsuite/OpenModelica/flattening/modelica/connectors/Bug3649.mo#L0
Bug3649.mo: Flattening returned null (expected a result)
Diagnostics:
[441:13-441:120] Error: [M4122] Cannot resolve type of expression v * Modelica.ComplexMath.conj(i). The operands have types ComplexVoltage, Real in component <NO_COMPONENT>.
[442:13-442:124] Error: [M4122] Cannot resolve type of expression v * Modelica.ComplexMath.conj(i). The operands have types ComplexVoltage, Real in component <NO_COMPONENT>.
[443:13-443:146] Error: [M4122] Cannot resolve type of expression v * Modelica.ComplexMath.conj(i). The operands have types ComplexVoltage, Real in component <NO_COMPONENT>.
[486:28-486:35] Error: Output variable 'residue' in function 'equalityConstraint' is not definitely assigned on all control flow paths.
[OpenModelica/flattening/modelica/connectors/Bug3649.mo:89:5-89:40] Error: [M5001] Type mismatch in equation pin_p1.i + pin_n1.i = Complex(0, 0) of type Real = Unknown.
[OpenModelica/flattening/modelica/connectors/Bug3649.mo:90:5-90:40] Error: [M5001] Type mismatch in equation pin_p2.i + pin_n2.i = Complex(0, 0) of type Real = Unknown.
[OpenModelica/flattening/modelica/connectors/Bug3649.mo:91:5-91:29] Error: [M5001] Type mismatch in equation v1 = Complex(+n, 0) * v2 of type Real = Unknown.
[OpenModelica/flattening/modelica/connectors/Bug3649.mo:92:5-92:29] Error: [M5001] Type mismatch in equation i2 = Complex(-n, 0) * i1 of type Real = Unknown.
[OpenModelica/flattening/modelica/connectors/Bug3649.mo:314:13-314:31] Error: [M5001] Type mismatch in equation pin.v = Complex(0) of type Real = Unknown.
[OpenModelica/flattening/modelica/connectors/Bug3649.mo:361:13-361:27] Error: [M5001] Type mismatch in equation i = Complex(0) of type Real = Unknown.
[OpenModelica/flattening/modelica/connectors/Bug3649.mo:362:13-362:18] Error: [M5001] Type mismatch in equation y = v of type Unknown = Real.
[OpenModelica/flattening/modelica/connectors/Bug3649.mo:370:13-370:27] Error: [M5001] Type mismatch in equation v = Complex(0) of type Real = Unknown.
[OpenModelica/flattening/modelica/connectors/Bug3649.mo:371:13-371:18] Error: [M5001] Type mismatch in equation y = i of type Unknown = Real.
[OpenModelica/flattening/modelica/connectors/Bug3649.mo:392:13-392:49] Error: [M5001] Type mismatch in equation currentP.i + currentN.i = Complex(0) of type Real = Unknown.
[OpenModelica/flattening/modelica/connectors/Bug3649.mo:393:13-393:49] Error: [M5001] Type mismatch in equation currentP.v - currentN.v = Complex(0) of type Real = Unknown.
[OpenModelica/flattening/modelica/connectors/Bug3649.mo:395:13-395:49] Error: [M5001] Type mismatch in equation voltageP.i + voltageN.i = Complex(0) of type Real = Unknown.
[OpenModelica/flattening/modelica/connectors/Bug3649.mo:396:13-396:36] Error: [M5001] Type mismatch in equation voltageP.i = Complex(0) of type Real = Unknown.
[OpenModelica/flattening/modelica/connectors/Bug3649.mo:412:13-412:52] Error: [M5001] Type mismatch in equation v = Complex(V * cos(phi), V * sin(phi)) of type Real = Unknown.
[OpenModelica/flattening/modelica/connectors/Bug3649.mo:459:13-459:43] Error: [M5001] Type mismatch in equation pin_p.i + pin_n.i = Complex(0) of type Real = Unknown. - No trace available
|
|
Failed Test: FillSubscriptsTest.mo:
languages/modelica/testsuite/OpenModelica/flattening/modelica/arrays/FillSubscriptsTest.mo#L0
FillSubscriptsTest.mo: Flattening returned null (expected a result)
Diagnostics:
[366:9-366:144] Error: [M2003] Class Medium.setState_pTX not found in scope Manifold (looking for a function or record).
[712:11-712:78] Error: [M4027] Component MMX of variability CONST has binding {steam.MM, dryair.MM} of higher variability VAR. - No trace available
|
|
Failed Test: incremental edit on a 3,500-line model evaluates lints in < 15 ms:
tests/incremental-linting.test.ts#L0
incremental edit on a 3,500-line model evaluates lints in < 15 ms: Parent suite 'Incremental Linting & Sub-Millisecond Diagnostic Suite' failed: failed running before hook (test timed out after 120000ms) - Error [ERR_TEST_FAILURE]: failed running before hook
Error [ERR_TEST_FAILURE]: test did not finish before its parent and was cancelled
|
|
Failed Test: should extract target expression for function call lookup:
tests/completion-context.test.ts#L0
should extract target expression for function call lookup: Parent suite 'SOTA CST Completion Context' failed: failed running before hook (test timed out after 120000ms) - Error [ERR_TEST_FAILURE]: failed running before hook
Error [ERR_TEST_FAILURE]: test did not finish before its parent and was cancelled
|
|
Failed Test: should extract target expression for array index lookup:
tests/completion-context.test.ts#L0
should extract target expression for array index lookup: Parent suite 'SOTA CST Completion Context' failed: failed running before hook (test timed out after 120000ms) - Error [ERR_TEST_FAILURE]: failed running before hook
Error [ERR_TEST_FAILURE]: test did not finish before its parent and was cancelled
|
|
Failed Test: should extract target expression and replacement range for simple dot access:
tests/completion-context.test.ts#L0
should extract target expression and replacement range for simple dot access: Parent suite 'SOTA CST Completion Context' failed: failed running before hook (test timed out after 120000ms) - Error [ERR_TEST_FAILURE]: failed running before hook
Error [ERR_TEST_FAILURE]: test did not finish before its parent and was cancelled
|
|
Failed Test: should incrementally parse mo del -> model -> model ElectricalCircuit ERROR:
tests/test-setup.ts#L0
should incrementally parse mo del -> model -> model ElectricalCircuit ERROR: Parent suite 'Full Modelica Grammar Hang Reproduction' failed: failed running before hook (test timed out after 300000ms) - Error [ERR_TEST_FAILURE]: failed running before hook
Error [ERR_TEST_FAILURE]: test did not finish before its parent and was cancelled
|
|
build
Node.js 20 is deprecated. The following actions target Node.js 20 but are being forced to run on Node.js 24: actions/cache@v4, actions/checkout@v4, actions/setup-node@v4, actions/upload-artifact@v4, nrwl/nx-set-shas@v4. For more information see: https://github.blog/changelog/2025-09-19-deprecation-of-node-20-on-github-actions-runners/
|
|
build
Neither a .vscodeignore file nor a "files" property in package.json was found. To ensure only necessary files are included in your extension, add a .vscodeignore file or specify the "files" property in package.json. More info: https://aka.ms/vscode-vscodeignore
|
|
test (2)
Node.js 20 is deprecated. The following actions target Node.js 20 but are being forced to run on Node.js 24: actions/cache@v4, actions/checkout@v4, actions/setup-node@v4, actions/upload-artifact@v4, nrwl/nx-set-shas@v4. For more information see: https://github.blog/changelog/2025-09-19-deprecation-of-node-20-on-github-actions-runners/
|
|
lint
Node.js 20 is deprecated. The following actions target Node.js 20 but are being forced to run on Node.js 24: actions/cache@v4, actions/checkout@v4, actions/setup-node@v4, nrwl/nx-set-shas@v4. For more information see: https://github.blog/changelog/2025-09-19-deprecation-of-node-20-on-github-actions-runners/
|
|
test (1)
Node.js 20 is deprecated. The following actions target Node.js 20 but are being forced to run on Node.js 24: actions/cache@v4, actions/checkout@v4, actions/setup-node@v4, actions/upload-artifact@v4, nrwl/nx-set-shas@v4. For more information see: https://github.blog/changelog/2025-09-19-deprecation-of-node-20-on-github-actions-runners/
|
|
test (3)
Node.js 20 is deprecated. The following actions target Node.js 20 but are being forced to run on Node.js 24: actions/cache@v4, actions/checkout@v4, actions/setup-node@v4, actions/upload-artifact@v4, nrwl/nx-set-shas@v4. For more information see: https://github.blog/changelog/2025-09-19-deprecation-of-node-20-on-github-actions-runners/
|
|
Modelica OMC Testsuite (WASM vs JS)
Node.js 20 is deprecated. The following actions target Node.js 20 but are being forced to run on Node.js 24: actions/cache@v4, actions/checkout@v4, actions/setup-node@v4, actions/upload-artifact@v4, nrwl/nx-set-shas@v4. For more information see: https://github.blog/changelog/2025-09-19-deprecation-of-node-20-on-github-actions-runners/
|
|
test (4)
Node.js 20 is deprecated. The following actions target Node.js 20 but are being forced to run on Node.js 24: actions/cache@v4, actions/checkout@v4, actions/setup-node@v4, actions/upload-artifact@v4, nrwl/nx-set-shas@v4. For more information see: https://github.blog/changelog/2025-09-19-deprecation-of-node-20-on-github-actions-runners/
|
|
publish_reports
Node.js 20 is deprecated. The following actions target Node.js 20 but are being forced to run on Node.js 24: actions/checkout@v4, actions/download-artifact@v4, actions/setup-node@v4, actions/upload-artifact@v4. For more information see: https://github.blog/changelog/2025-09-19-deprecation-of-node-20-on-github-actions-runners/
|
|
build
"The ubuntu-latest label will migrate to Ubuntu 26 beginning October 19, 2026. For more information, see https://github.com/actions/runner-images/issues/14748"
|
|
test (2)
"The ubuntu-latest label will migrate to Ubuntu 26 beginning October 19, 2026. For more information, see https://github.com/actions/runner-images/issues/14748"
|
|
lint
"The ubuntu-latest label will migrate to Ubuntu 26 beginning October 19, 2026. For more information, see https://github.com/actions/runner-images/issues/14748"
|
|
test (1)
"The ubuntu-latest label will migrate to Ubuntu 26 beginning October 19, 2026. For more information, see https://github.com/actions/runner-images/issues/14748"
|
|
test (3)
"The ubuntu-latest label will migrate to Ubuntu 26 beginning October 19, 2026. For more information, see https://github.com/actions/runner-images/issues/14748"
|
|
Modelica OMC Testsuite (WASM vs JS)
"The ubuntu-latest label will migrate to Ubuntu 26 beginning October 19, 2026. For more information, see https://github.com/actions/runner-images/issues/14748"
|
|
test (4)
"The ubuntu-latest label will migrate to Ubuntu 26 beginning October 19, 2026. For more information, see https://github.com/actions/runner-images/issues/14748"
|
|
publish_reports
"The ubuntu-latest label will migrate to Ubuntu 26 beginning October 19, 2026. For more information, see https://github.com/actions/runner-images/issues/14748"
|
Artifacts
Produced during runtime
| Name | Size | Digest | |
|---|---|---|---|
|
consolidated-coverage
|
2.09 MB |
sha256:ebac6c9191341079c305d198a91260d411e9d45f87444b77b7954671840477e4
|
|
|
consolidated-test-report
|
888 KB |
sha256:1acf16152653438a71e9c1e7b9378154f4b2d4922820ffbe999351c8f6bcf971
|
|
|
coverage-1
|
1.41 MB |
sha256:c44b42216b078fe3c43cccb9168d25ee947b8d620de23d4208c7edd7e3fe2a84
|
|
|
coverage-2
|
1.52 MB |
sha256:dec8f93461ccd44787c4f5c9b8be7902dc4bd3e6312baeca62ef11d87051e5c5
|
|
|
coverage-3
|
2.12 MB |
sha256:01e1070ff95ca880eafe2393232ef823d253888bfcb60a5876fa795bf3c67696
|
|
|
coverage-4
|
3.41 MB |
sha256:d919860628173f7c7532e3bc2c0adf484bbc81a8fabcc41dde67f2cbf1b2dbd8
|
|
|
ctrf-1
|
116 KB |
sha256:d257f66b8160b3a2e4b1eeed24a96c336fa7b1366609b44912030edc7bb774ae
|
|
|
ctrf-2
|
106 KB |
sha256:12249171326b4417fefe1d45fde22f65601deaec31336281e8c10ae621eaacc0
|
|
|
ctrf-3
|
150 KB |
sha256:4b7d76fb506b30202271ba584b1f890a4035c1f419af1348b87da509c956faaa
|
|
|
ctrf-4
|
136 KB |
sha256:b585659fcbf375b914f248ef99047803f9d7b052eec94538c40bc899d216ea4d
|
|
|
ctrf-omc-testsuite
|
387 KB |
sha256:667172e4b776d53c1e934384a2c71dc975b5e8da53a9315f8c52a91e4f32fc3b
|
|
|
modelscript-vsix
|
23.2 KB |
sha256:f73dda40efb32c2db39fea4439af66e27031d37402d922e3771fabcc2f3a4b91
|
|
|
omc-testsuite-html-reports
|
531 KB |
sha256:acbde687ce18e56b1ecb42d47d076529eba0227b66b8c5d57718938c8a53d9b4
|
|
You can’t perform that action at this time.
