{{ message }}
Repository navigation
fix: resolve DAE variable resolution, FEA residual normalization, and… #935
ci.yml
on: push
Matrix: test
Modelica OMC Testsuite (WASM vs JS)
23m 45s
publish_reports
2m 4s
Oh hello! Nice to see you.
Made with ❤️ by humans.txt
Annotations
11 errors, 9 warnings, and 8 notices
|
test (4)
Process completed with exit code 1.
|
|
Failed Test: should extract target expression for array index lookup:
tests/completion-context.test.ts#L0
should extract target expression for array index lookup: Parent suite 'SOTA CST Completion Context' failed: failed running before hook (test timed out after 120000ms) - Error [ERR_TEST_FAILURE]: failed running before hook
Error [ERR_TEST_FAILURE]: test did not finish before its parent and was cancelled
|
|
Failed Test: should extract target expression and replacement range for simple dot access:
tests/completion-context.test.ts#L0
should extract target expression and replacement range for simple dot access: Parent suite 'SOTA CST Completion Context' failed: failed running before hook (test timed out after 120000ms) - Error [ERR_TEST_FAILURE]: failed running before hook
Error [ERR_TEST_FAILURE]: test did not finish before its parent and was cancelled
|
|
Failed Test: should incrementally parse mo del -> model -> model ElectricalCircuit ERROR:
tests/test-setup.ts#L0
should incrementally parse mo del -> model -> model ElectricalCircuit ERROR: Parent suite 'Full Modelica Grammar Hang Reproduction' failed: failed running before hook (test timed out after 300000ms) - Error [ERR_TEST_FAILURE]: failed running before hook
Error [ERR_TEST_FAILURE]: test did not finish before its parent and was cancelled
|
|
Failed Test: should discover all workspace languages from the languages/ directory:
tests/language-discovery.test.ts#L0
should discover all workspace languages from the languages/ directory: Should include modelica.wasm asset - AssertionError [ERR_ASSERTION]: Should include modelica.wasm asset
at TestContext.<anonymous> (/home/runner/work/modelscript/modelscript/packages/dsl/tests/language-discovery.test.ts:36:12)
at async Test.run (node:internal/test_runner/test:1409:7)
at async Promise.all (index 0)
at async Suite.run (node:internal/test_runner/test:1905:7)
at async startSubtestAfterBootstrap (node:internal/test_runner/harness:387:3)
Error [ERR_TEST_FAILURE]: Should include modelica.wasm asset
at async Promise.all (index 0)
|
|
Failed Test: should anchor the missing semicolon diagnostic to the previous token instead of the next line:
tests/recovery-branches.test.ts#L0
should anchor the missing semicolon diagnostic to the previous token instead of the next line: Parent suite 'GLR Parser Error Recovery Branches' failed: failed running before hook (test timed out after 120000ms) - Error [ERR_TEST_FAILURE]: failed running before hook
Error [ERR_TEST_FAILURE]: test did not finish before its parent and was cancelled
Error [ERR_TEST_FAILURE]: test did not finish before its parent and was cancelled
|
|
Failed Test: should run with config: All Enabled (Default):
tests/recovery-branches.test.ts#L0
should run with config: All Enabled (Default): Parent suite 'GLR Parser Error Recovery Branches' failed: failed running before hook (test timed out after 120000ms) - Error [ERR_TEST_FAILURE]: failed running before hook
Error [ERR_TEST_FAILURE]: test did not finish before its parent and was cancelled
Error [ERR_TEST_FAILURE]: test did not finish before its parent and was cancelled
|
|
Failed Test: should run with config: Only Island Mode:
tests/recovery-branches.test.ts#L0
should run with config: Only Island Mode: Parent suite 'GLR Parser Error Recovery Branches' failed: failed running before hook (test timed out after 120000ms) - Error [ERR_TEST_FAILURE]: failed running before hook
Error [ERR_TEST_FAILURE]: test did not finish before its parent and was cancelled
Error [ERR_TEST_FAILURE]: test did not finish before its parent and was cancelled
|
|
Failed Test: should run with config: Only Branch C (Forced Reduction):
tests/recovery-branches.test.ts#L0
should run with config: Only Branch C (Forced Reduction): Parent suite 'GLR Parser Error Recovery Branches' failed: failed running before hook (test timed out after 120000ms) - Error [ERR_TEST_FAILURE]: failed running before hook
Error [ERR_TEST_FAILURE]: test did not finish before its parent and was cancelled
Error [ERR_TEST_FAILURE]: test did not finish before its parent and was cancelled
|
|
Failed Test: should run with config: Only Branch B (Insertion):
tests/recovery-branches.test.ts#L0
should run with config: Only Branch B (Insertion): Parent suite 'GLR Parser Error Recovery Branches' failed: failed running before hook (test timed out after 120000ms) - Error [ERR_TEST_FAILURE]: failed running before hook
Error [ERR_TEST_FAILURE]: test did not finish before its parent and was cancelled
Error [ERR_TEST_FAILURE]: test did not finish before its parent and was cancelled
|
|
Failed Test: should run with config: Only Branch A (Deletion):
tests/recovery-branches.test.ts#L0
should run with config: Only Branch A (Deletion): Parent suite 'GLR Parser Error Recovery Branches' failed: failed running before hook (test timed out after 120000ms) - Error [ERR_TEST_FAILURE]: failed running before hook
Error [ERR_TEST_FAILURE]: test did not finish before its parent and was cancelled
Error [ERR_TEST_FAILURE]: test did not finish before its parent and was cancelled
|
|
build
Node.js 20 is deprecated. The following actions target Node.js 20 but are being forced to run on Node.js 24: actions/cache@v4, actions/checkout@v4, actions/setup-node@v4, actions/upload-artifact@v4, nrwl/nx-set-shas@v4. For more information see: https://github.blog/changelog/2025-09-19-deprecation-of-node-20-on-github-actions-runners/
|
|
build
Neither a .vscodeignore file nor a "files" property in package.json was found. To ensure only necessary files are included in your extension, add a .vscodeignore file or specify the "files" property in package.json. More info: https://aka.ms/vscode-vscodeignore
|
|
lint
Node.js 20 is deprecated. The following actions target Node.js 20 but are being forced to run on Node.js 24: actions/cache@v4, actions/checkout@v4, actions/setup-node@v4, nrwl/nx-set-shas@v4. For more information see: https://github.blog/changelog/2025-09-19-deprecation-of-node-20-on-github-actions-runners/
|
|
test (1)
Node.js 20 is deprecated. The following actions target Node.js 20 but are being forced to run on Node.js 24: actions/cache@v4, actions/checkout@v4, actions/setup-node@v4, actions/upload-artifact@v4, nrwl/nx-set-shas@v4. For more information see: https://github.blog/changelog/2025-09-19-deprecation-of-node-20-on-github-actions-runners/
|
|
test (2)
Node.js 20 is deprecated. The following actions target Node.js 20 but are being forced to run on Node.js 24: actions/cache@v4, actions/checkout@v4, actions/setup-node@v4, actions/upload-artifact@v4, nrwl/nx-set-shas@v4. For more information see: https://github.blog/changelog/2025-09-19-deprecation-of-node-20-on-github-actions-runners/
|
|
test (3)
Node.js 20 is deprecated. The following actions target Node.js 20 but are being forced to run on Node.js 24: actions/cache@v4, actions/checkout@v4, actions/setup-node@v4, actions/upload-artifact@v4, nrwl/nx-set-shas@v4. For more information see: https://github.blog/changelog/2025-09-19-deprecation-of-node-20-on-github-actions-runners/
|
|
Modelica OMC Testsuite (WASM vs JS)
Node.js 20 is deprecated. The following actions target Node.js 20 but are being forced to run on Node.js 24: actions/cache@v4, actions/checkout@v4, actions/setup-node@v4, actions/upload-artifact@v4, nrwl/nx-set-shas@v4. For more information see: https://github.blog/changelog/2025-09-19-deprecation-of-node-20-on-github-actions-runners/
|
|
test (4)
Node.js 20 is deprecated. The following actions target Node.js 20 but are being forced to run on Node.js 24: actions/cache@v4, actions/checkout@v4, actions/setup-node@v4, actions/upload-artifact@v4, nrwl/nx-set-shas@v4. For more information see: https://github.blog/changelog/2025-09-19-deprecation-of-node-20-on-github-actions-runners/
|
|
publish_reports
Node.js 20 is deprecated. The following actions target Node.js 20 but are being forced to run on Node.js 24: actions/checkout@v4, actions/download-artifact@v4, actions/setup-node@v4, actions/upload-artifact@v4. For more information see: https://github.blog/changelog/2025-09-19-deprecation-of-node-20-on-github-actions-runners/
|
|
build
"The ubuntu-latest label will migrate to Ubuntu 26 beginning October 19, 2026. For more information, see https://github.com/actions/runner-images/issues/14748"
|
|
lint
"The ubuntu-latest label will migrate to Ubuntu 26 beginning October 19, 2026. For more information, see https://github.com/actions/runner-images/issues/14748"
|
|
test (1)
"The ubuntu-latest label will migrate to Ubuntu 26 beginning October 19, 2026. For more information, see https://github.com/actions/runner-images/issues/14748"
|
|
test (2)
"The ubuntu-latest label will migrate to Ubuntu 26 beginning October 19, 2026. For more information, see https://github.com/actions/runner-images/issues/14748"
|
|
test (3)
"The ubuntu-latest label will migrate to Ubuntu 26 beginning October 19, 2026. For more information, see https://github.com/actions/runner-images/issues/14748"
|
|
Modelica OMC Testsuite (WASM vs JS)
"The ubuntu-latest label will migrate to Ubuntu 26 beginning October 19, 2026. For more information, see https://github.com/actions/runner-images/issues/14748"
|
|
test (4)
"The ubuntu-latest label will migrate to Ubuntu 26 beginning October 19, 2026. For more information, see https://github.com/actions/runner-images/issues/14748"
|
|
publish_reports
"The ubuntu-latest label will migrate to Ubuntu 26 beginning October 19, 2026. For more information, see https://github.com/actions/runner-images/issues/14748"
|
Artifacts
Produced during runtime
| Name | Size | Digest | |
|---|---|---|---|
|
consolidated-coverage
|
2.07 MB |
sha256:c5ff28dbaa6e5c285b9f27b463a36363a5787ac0ec58e62fbb7985d90ef22982
|
|
|
consolidated-test-report
|
920 KB |
sha256:f3e563971e57af24b1ccc1e4274a44a59a7773b5f707060aeb421ca2a2b7da87
|
|
|
coverage-1
|
1.41 MB |
sha256:ab9759cee184732f2ed141a696856a624d9fe102974852d96fee2b336e677cc8
|
|
|
coverage-2
|
1.52 MB |
sha256:78858c580f64f4f3d953955823bc07a4747d56c19697a39fc4a00ea5a0e8a19e
|
|
|
coverage-3
|
2.05 MB |
sha256:de9a952dc3010fa90a4841add51ee1c611fde9e5da5fd4c2aeb99905ce919f5c
|
|
|
coverage-4
|
3.41 MB |
sha256:0ccc128b622d82203b0a7bf4f2c7a4373d3a3731acd59e20c8113e3d5520572d
|
|
|
ctrf-1
|
116 KB |
sha256:4eb33bb951b7d03bf7718e6faccdce183d14d18507940aba987e78eee9e48848
|
|
|
ctrf-2
|
106 KB |
sha256:828ad40e29e3907810e041c34768f51cc3a849d535b7d0e4127eeba2e5523d62
|
|
|
ctrf-3
|
150 KB |
sha256:35938525ea0e545ceed95774d8fd4893dfbc09525b397e74a903e0e9a8385964
|
|
|
ctrf-4
|
138 KB |
sha256:5438584608227536a5999c241590381d4df06dd4b3085fe9e26e4c96a4cd37fc
|
|
|
ctrf-omc-testsuite
|
402 KB |
sha256:f8c03a66398ad441c601bd60204f8790e5a687739aff5bd09e1130003f201884
|
|
|
modelscript-vsix
|
23.2 KB |
sha256:a9c8230290276b417ccf0ac210fa62b72717678c49094761e9e6b5efca9174a5
|
|
|
omc-testsuite-html-reports
|
560 KB |
sha256:9876258a2d13eac4e8026056f59c800704363fdb58353478cb64ddab3d07891a
|
|
You can’t perform that action at this time.
